Reaction Details
TargetDipeptidyl peptidase 8
LigandBDBM50338440
Substrate/Competitorn/a
Meas. Tech.ChEMBL_728291 (CHEMBL1687448)
IC50 170±n/a nM
Citation Chen, PCaldwell, CGAshton, WWu, JKHe, HLyons, KAThornberry, NAWeber, AE Synthesis and evaluation of [(1R)-1-amino-2-(2,5-difluorophenyl)ethyl]cyclohexanes and 4-[(1R)-1-amino-2-(2,5-difluorophenyl)ethyl]piperidines as DPP-4 inhibitors. Bioorg Med Chem Lett21:1880-6 (2011) 
 
Dipeptidyl peptidase 8
Name:Dipeptidyl peptidase 8
Type:Enzyme
Mol. Mass.:103342.62
Organism:Homo sapiens (Human)
Description:Q6V1X1
Residue:898
BDBM50338440
NameBDBM50338440
Synonyms:CHEMBL1682974 | trans-N-(4-((S)-1-amino-2-oxo-2-(thiazolidin-3-yl)ethyl)cyclohexyl)-4-(trifluoromethoxy)benzamide
TypeSmall organic molecule
Emp. Form.C19H24F3N3O3S
Mol. Mass.431.472
SMILESN[C@@H]([C@H]1CC[C@@H](CC1)NC(=O)c1ccc(OC(F)(F)F)cc1)C(=O)N1CCSC1