Reaction Details
TargetDipeptidyl peptidase 4
LigandBDBM50338424
Substrate/Competitorn/a
Meas. Tech.ChEMBL_728292 (CHEMBL1687449)
IC50 130±n/a nM
Citation Chen, PCaldwell, CGAshton, WWu, JKHe, HLyons, KAThornberry, NAWeber, AE Synthesis and evaluation of [(1R)-1-amino-2-(2,5-difluorophenyl)ethyl]cyclohexanes and 4-[(1R)-1-amino-2-(2,5-difluorophenyl)ethyl]piperidines as DPP-4 inhibitors. Bioorg Med Chem Lett21:1880-6 (2011) 
 
Dipeptidyl peptidase 4
Name:Dipeptidyl peptidase 4
Type:Enzyme
Mol. Mass.:88271.01
Organism:Homo sapiens (Human)
Description:P27487
Residue:766
BDBM50338424
NameBDBM50338424
Synonyms:(R)-2-(2,5-difluorophenyl)-1-(1-(methylsulfonyl)piperidin-4-yl)ethanamine | CHEMBL1683130
TypeSmall organic molecule
Emp. Form.C14H20F2N2O2S
Mol. Mass.318.383
SMILESCS(=O)(=O)N1CCC(CC1)[C@H](N)Cc1cc(F)ccc1F