Reaction Details
TargetDipeptidyl peptidase 4
LigandBDBM50338435
Substrate/Competitorn/a
Meas. Tech.ChEMBL_728292 (CHEMBL1687449)
IC50 78±n/a nM
Citation Chen, PCaldwell, CGAshton, WWu, JKHe, HLyons, KAThornberry, NAWeber, AE Synthesis and evaluation of [(1R)-1-amino-2-(2,5-difluorophenyl)ethyl]cyclohexanes and 4-[(1R)-1-amino-2-(2,5-difluorophenyl)ethyl]piperidines as DPP-4 inhibitors. Bioorg Med Chem Lett21:1880-6 (2011) 
 
Dipeptidyl peptidase 4
Name:Dipeptidyl peptidase 4
Type:Enzyme
Mol. Mass.:88271.01
Organism:Homo sapiens (Human)
Description:P27487
Residue:766
BDBM50338435
NameBDBM50338435
Synonyms:(R)-2-(2,5-difluorophenyl)-1-(1-(2-methoxypyrimidin-5-yl)piperidin-4-yl)ethanamine | CHEMBL1683141
TypeSmall organic molecule
Emp. Form.C18H22F2N4O
Mol. Mass.348.3903
SMILESCOc1ncc(cn1)N1CCC(CC1)[C@H](N)Cc1cc(F)ccc1F