Reaction Details
TargetDipeptidyl peptidase 4
LigandBDBM50338437
Substrate/Competitorn/a
Meas. Tech.ChEMBL_728292 (CHEMBL1687449)
IC50 54±n/a nM
Citation Chen, PCaldwell, CGAshton, WWu, JKHe, HLyons, KAThornberry, NAWeber, AE Synthesis and evaluation of [(1R)-1-amino-2-(2,5-difluorophenyl)ethyl]cyclohexanes and 4-[(1R)-1-amino-2-(2,5-difluorophenyl)ethyl]piperidines as DPP-4 inhibitors. Bioorg Med Chem Lett21:1880-6 (2011) 
 
Dipeptidyl peptidase 4
Name:Dipeptidyl peptidase 4
Type:Enzyme
Mol. Mass.:88271.01
Organism:Homo sapiens (Human)
Description:P27487
Residue:766
BDBM50338437
NameBDBM50338437
Synonyms:CHEMBL1683143 | methyl 3-(4-((R)-1-amino-2-(2,5-difluorophenyl)ethyl)piperidin-1-yl)cyclohexanecarboxylate
TypeSmall organic molecule
Emp. Form.C21H30F2N2O2
Mol. Mass.380.4719
SMILESCOC(=O)C1CCCC(C1)N1CCC(CC1)[C@H](N)Cc1cc(F)ccc1F