Reaction Details
TargetDipeptidyl peptidase 4
LigandBDBM50338451
Substrate/Competitorn/a
Meas. Tech.ChEMBL_728292 (CHEMBL1687449)
IC50 94±n/a nM
Citation Chen, PCaldwell, CGAshton, WWu, JKHe, HLyons, KAThornberry, NAWeber, AE Synthesis and evaluation of [(1R)-1-amino-2-(2,5-difluorophenyl)ethyl]cyclohexanes and 4-[(1R)-1-amino-2-(2,5-difluorophenyl)ethyl]piperidines as DPP-4 inhibitors. Bioorg Med Chem Lett21:1880-6 (2011) 
 
Dipeptidyl peptidase 4
Name:Dipeptidyl peptidase 4
Type:Enzyme
Mol. Mass.:88271.01
Organism:Homo sapiens (Human)
Description:P27487
Residue:766
BDBM50338451
NameBDBM50338451
Synonyms:CHEMBL1682985 | trans-N-(4-((R)-1-amino-2-(2,5-difluorophenyl)ethyl)cyclohexyl)-N-methyl-4-(1,2,3-thiadiazol-4-yl)benzenesulfonamide
TypeSmall organic molecule
Emp. Form.C23H26F2N4O2S2
Mol. Mass.492.605
SMILESCN([C@H]1CC[C@@H](CC1)[C@H](N)Cc1cc(F)ccc1F)S(=O)(=O)c1ccc(cc1)-c1csnn1