Reaction Details
TargetDipeptidyl peptidase 4
LigandBDBM50338471
Substrate/Competitorn/a
Meas. Tech.ChEMBL_728292 (CHEMBL1687449)
IC50 120±n/a nM
Citation Chen, PCaldwell, CGAshton, WWu, JKHe, HLyons, KAThornberry, NAWeber, AE Synthesis and evaluation of [(1R)-1-amino-2-(2,5-difluorophenyl)ethyl]cyclohexanes and 4-[(1R)-1-amino-2-(2,5-difluorophenyl)ethyl]piperidines as DPP-4 inhibitors. Bioorg Med Chem Lett21:1880-6 (2011) 
 
Dipeptidyl peptidase 4
Name:Dipeptidyl peptidase 4
Type:Enzyme
Mol. Mass.:88271.01
Organism:Homo sapiens (Human)
Description:P27487
Residue:766
BDBM50338471
NameBDBM50338471
Synonyms:CHEMBL1683105 | trans-N-(4-((R)-1-amino-2-(2,5-difluorophenyl)ethyl)cyclohexyl)-N-methyl-1,2,3-thiadiazole-4-carboxamide
TypeSmall organic molecule
Emp. Form.C18H22F2N4OS
Mol. Mass.380.455
SMILESCN([C@H]1CC[C@@H](CC1)[C@H](N)Cc1cc(F)ccc1F)C(=O)c1csnn1