Reaction Details
TargetDipeptidyl peptidase 4
LigandBDBM50338436
Substrate/Competitorn/a
Meas. Tech.ChEMBL_728292 (CHEMBL1687449)
IC50 72±n/a nM
Citation Chen, PCaldwell, CGAshton, WWu, JKHe, HLyons, KAThornberry, NAWeber, AE Synthesis and evaluation of [(1R)-1-amino-2-(2,5-difluorophenyl)ethyl]cyclohexanes and 4-[(1R)-1-amino-2-(2,5-difluorophenyl)ethyl]piperidines as DPP-4 inhibitors. Bioorg Med Chem Lett21:1880-6 (2011) 
 
Dipeptidyl peptidase 4
Name:Dipeptidyl peptidase 4
Type:Enzyme
Mol. Mass.:88271.01
Organism:Homo sapiens (Human)
Description:P27487
Residue:766
BDBM50338436
NameBDBM50338436
Synonyms:(R)-5-(4-(1-amino-2-(2,5-difluorophenyl)ethyl)piperidin-1-yl)pyrimidin-2-ol | CHEMBL1683142
TypeSmall organic molecule
Emp. Form.C17H20F2N4O
Mol. Mass.334.3637
SMILESN[C@H](Cc1cc(F)ccc1F)C1CCN(CC1)c1cnc(=O)[nH]c1