Reaction Details
TargetDipeptidyl peptidase 4
LigandBDBM50338516
Substrate/Competitorn/a
Meas. Tech.ChEMBL_728457 (CHEMBL1685334)
IC50 37±n/a nM
Citation Andrews, KMBeebe, DABenbow, JWBoyer, DADoran, SDHui, YLiu, SMcPherson, RKNeagu, CParker, JCPiotrowski, DWSchneider, SRTreadway, JLVanVolkenberg, MAZembrowski, WJ 1-((3S,4S)-4-amino-1-(4-substituted-1,3,5-triazin-2-yl) pyrrolidin-3-yl)-5,5-difluoropiperidin-2-one inhibitors of DPP-4 for the treatment of type 2 diabetes. Bioorg Med Chem Lett21:1810-4 (2011) 
 
Dipeptidyl peptidase 4
Name:Dipeptidyl peptidase 4
Type:Enzyme
Mol. Mass.:88271.01
Organism:Homo sapiens (Human)
Description:P27487
Residue:766
BDBM50338516
NameBDBM50338516
Synonyms:1-((3S,4S)-4-amino-1-(4-(3,3-difluoropyrrolidin-1-yl)-1,3,5-triazin-2-yl)pyrrolidin-3-yl)piperidin-2-one | CHEMBL1683569
TypeSmall organic molecule
Emp. Form.C16H23F2N7O
Mol. Mass.367.3969
SMILESN[C@H]1CN(C[C@@H]1N1CCCCC1=O)c1ncnc(n1)N1CCC(F)(F)C1