Reaction Details
TargetCoagulation factor X
LigandBDBM50338679
Substrate/Competitorn/a
Meas. Tech.ChEMBL_726871 (CHEMBL1686577)
Ki 6±n/a nM
Citation Young, RJAdams, CBlows, MBrown, DBurns-Kurtis, CLChan, CChaudry, LConvery, MADavies, DEExall, AMFoster, GHarling, JDHortense, EIrvine, SIrving, WRJackson, SKleanthous, SPateman, AJPatikis, ANRoethka, TJSenger, SStelman, GJToomey, JRWest, RIWhittaker, CZhou, PWatson, NS Structure and property based design of factor Xa inhibitors: pyrrolidin-2-ones with aminoindane and phenylpyrrolidine P4 motifs. Bioorg Med Chem Lett21:1582-7 (2011) 
 
Coagulation factor X
Name:Coagulation factor X
Type:Enzyme
Mol. Mass.:54726.60
Organism:Homo sapiens (Human)
Description:n/a
Residue:488
BDBM50338679
NameBDBM50338679
Synonyms:(E)-2-(5-chlorothiophen-2-yl)-N-((S)-1-(2-fluoro-4-((S)-pyrrolidin-2-yl)phenyl)-2-oxopyrrolidin-3-yl)ethenesulfonamide | CHEMBL1684193
TypeSmall organic molecule
Emp. Form.C20H21ClFN3O3S2
Mol. Mass.469.98
SMILESFc1cc(ccc1N1CC[C@H](NS(=O)(=O)\C=C\c2ccc(Cl)s2)C1=O)[C@@H]1CCCN1