Reaction Details
TargetCoagulation factor X
LigandBDBM50338682
Substrate/Competitorn/a
Meas. Tech.ChEMBL_726871 (CHEMBL1686577)
Ki 2±n/a nM
Citation Young, RJAdams, CBlows, MBrown, DBurns-Kurtis, CLChan, CChaudry, LConvery, MADavies, DEExall, AMFoster, GHarling, JDHortense, EIrvine, SIrving, WRJackson, SKleanthous, SPateman, AJPatikis, ANRoethka, TJSenger, SStelman, GJToomey, JRWest, RIWhittaker, CZhou, PWatson, NS Structure and property based design of factor Xa inhibitors: pyrrolidin-2-ones with aminoindane and phenylpyrrolidine P4 motifs. Bioorg Med Chem Lett21:1582-7 (2011) 
 
Coagulation factor X
Name:Coagulation factor X
Type:Enzyme
Mol. Mass.:54726.60
Organism:Homo sapiens (Human)
Description:n/a
Residue:488
BDBM50338682
NameBDBM50338682
Synonyms:(R/S)-3-chloro-N-((3S)-1-(2-fluoro-4-(pyrrolidin-2-yl)phenyl)-2-oxopyrrolidin-3-yl)-1H-indole-6-sulfonamide | CHEMBL1684190
TypeSmall organic molecule
Emp. Form.C22H22ClFN4O3S
Mol. Mass.476.951
SMILESFc1cc(ccc1N1CC[C@H](NS(=O)(=O)c2ccc3c(Cl)c[nH]c3c2)C1=O)C1CCCN1