Reaction Details
TargetCoagulation factor X
LigandBDBM50338687
Substrate/Competitorn/a
Meas. Tech.ChEMBL_726871 (CHEMBL1686577)
Ki 5±n/a nM
Citation Young, RJAdams, CBlows, MBrown, DBurns-Kurtis, CLChan, CChaudry, LConvery, MADavies, DEExall, AMFoster, GHarling, JDHortense, EIrvine, SIrving, WRJackson, SKleanthous, SPateman, AJPatikis, ANRoethka, TJSenger, SStelman, GJToomey, JRWest, RIWhittaker, CZhou, PWatson, NS Structure and property based design of factor Xa inhibitors: pyrrolidin-2-ones with aminoindane and phenylpyrrolidine P4 motifs. Bioorg Med Chem Lett21:1582-7 (2011) 
 
Coagulation factor X
Name:Coagulation factor X
Type:Enzyme
Mol. Mass.:54726.60
Organism:Homo sapiens (Human)
Description:n/a
Residue:488
BDBM50338687
NameBDBM50338687
Synonyms:(R/S)-6-chloro-N-((3S)-1-(1-(methylamino)-2,3-dihydro-1H-inden-5-yl)-2-oxopyrrolidin-3-yl)naphthalene-2-sulfonamide | CHEMBL1684183
TypeSmall organic molecule
Emp. Form.C24H24ClN3O3S
Mol. Mass.469.984
SMILESCNC1CCc2cc(ccc12)N1CC[C@H](NS(=O)(=O)c2ccc3cc(Cl)ccc3c2)C1=O