Reaction Details
TargetCoagulation factor X
LigandBDBM50338691
Substrate/Competitorn/a
Meas. Tech.ChEMBL_726871 (CHEMBL1686577)
Ki 2±n/a nM
Citation Young, RJAdams, CBlows, MBrown, DBurns-Kurtis, CLChan, CChaudry, LConvery, MADavies, DEExall, AMFoster, GHarling, JDHortense, EIrvine, SIrving, WRJackson, SKleanthous, SPateman, AJPatikis, ANRoethka, TJSenger, SStelman, GJToomey, JRWest, RIWhittaker, CZhou, PWatson, NS Structure and property based design of factor Xa inhibitors: pyrrolidin-2-ones with aminoindane and phenylpyrrolidine P4 motifs. Bioorg Med Chem Lett21:1582-7 (2011) 
 
Coagulation factor X
Name:Coagulation factor X
Type:Enzyme
Mol. Mass.:54726.60
Organism:Homo sapiens (Human)
Description:n/a
Residue:488
BDBM50338691
NameBDBM50338691
Synonyms:6-CHLORO-N-[(3S)-1-[(1S)-1-DIMETHYLAMINO-2,3-DIHYDRO-1H-INDEN-5-YL]-2-OXO-PYRROLIDIN-3-YL]NAPHTHALENE-2-SULFONAMIDE CHEMBL1614872
TypeSmall organic molecule
Emp. Form.C25H26ClN3O3S
Mol. Mass.484.01
SMILESCN(C)[C@H]1CCc2cc(ccc12)N1CC[C@H](NS(=O)(=O)c2ccc3cc(Cl)ccc3c2)C1=O