Reaction Details
TargetGlucocorticoid receptor
LigandBDBM50338732
Substrate/Competitorn/a
Meas. Tech.ChEMBL_726913 (CHEMBL1686702)
Ki 3±n/a nM
Citation Roach, SLHiguchi, RIHudson, ARVassar, AGrant, VHLamer, RHooper, CRungta, DSyka, PMMais, DEMarschke, KBZhi, L Tetrahydroquinolin-3-yl carbamate glucocorticoid receptor agonists with reduced PEPCK activation. Bioorg Med Chem Lett21:1658-62 (2011) 
 
Glucocorticoid receptor
Name:Glucocorticoid receptor
Type:Enzyme
Mol. Mass.:85656.87
Organism:Homo sapiens (Human)
Description:P04150
Residue:777
BDBM50338732
NameBDBM50338732
Synonyms:(+/-)-(3R,4S)-5,7-difluoro-6-(1H-indol-7-yl)-2,2,4-trimethyl-1,2,3,4-tetrahydroquinolin-3-yl methylcarbamate | CHEMBL1684230
TypeSmall organic molecule
Emp. Form.C22H23F2N3O2
Mol. Mass.399.4337
SMILESCNC(=O)O[C@@H]1[C@@H](C)c2c(NC1(C)C)cc(F)c(c2F)-c1cccc2cc[nH]c12