Reaction Details
TargetVasopressin V1b receptor
LigandBDBM50299343
Substrate/Competitorn/a
Meas. Tech.ChEMBL_727044 (CHEMBL1686968)
Ki 1±n/a nM
Citation Napier, SELetourneau, JJAnsari, NAuld, DSBaker, JBest, SCampbell-Wan, LChan, JHCraighead, MDesai, HGoan, KAHo, KKHulskotte, EGMacSweeney, CPMilne, RMorphy, JRNeagu, IOhlmeyer, MHPeeters, AWPresland, JRiviello, CRuigt, GSThomson, FJZanetakos, HAZhao, JWebb, ML Synthesis and SAR studies of novel 2-(4-oxo-2-aryl-quinazolin-3(4H)-yl)acetamide vasopressin V1b receptor antagonists. Bioorg Med Chem Lett21:1871-5 (2011) 
 
Vasopressin V1b receptor
Name:Vasopressin V1b receptor
Type:Enzyme Catalytic Domain
Mol. Mass.:47104.48
Organism:RAT
Description:VASOPRESSIN V1B AVPR1B RAT::P48974
Residue:425
BDBM50299343
NameBDBM50299343
Synonyms:(2S,4R)-1-((R)-5-chloro-1-(2,4-dimethoxyphenylsulfonyl)-3-(2-methoxyphenyl)-2-oxoindolin-3-yl)-4-hydroxy-N,N-dimethylpyrrolidine-2-carboxamide CHEMBL582857 SSR149415
TypeSmall organic molecule
Emp. Form.C30H32ClN3O8S
Mol. Mass.630.108
SMILESCOc1ccc(c(OC)c1)S(=O)(=O)N1C(=O)[C@@](N2C[C@H](O)C[C@H]2C(=O)N(C)C)(c2cc(Cl)ccc12)c1ccccc1OC