Reaction Details
TargetVasopressin V1b receptor
LigandBDBM50338810
Substrate/Competitorn/a
Meas. Tech.ChEMBL_727040 (CHEMBL1686964)
IC50 3±n/a nM
Citation Napier, SELetourneau, JJAnsari, NAuld, DSBaker, JBest, SCampbell-Wan, LChan, JHCraighead, MDesai, HGoan, KAHo, KKHulskotte, EGMacSweeney, CPMilne, RMorphy, JRNeagu, IOhlmeyer, MHPeeters, AWPresland, JRiviello, CRuigt, GSThomson, FJZanetakos, HAZhao, JWebb, ML Synthesis and SAR studies of novel 2-(4-oxo-2-aryl-quinazolin-3(4H)-yl)acetamide vasopressin V1b receptor antagonists. Bioorg Med Chem Lett21:1871-5 (2011) 
 
Vasopressin V1b receptor
Name:Vasopressin V1b receptor
Type:Enzyme
Mol. Mass.:46985.01
Organism:Homo sapiens (Human)
Description:P47901
Residue:424
BDBM50338810
NameBDBM50338810
Synonyms:CHEMBL1684573 | N-isopropyl-2-(2-(3-methoxyphenyl)-4-oxo-6-(3-(piperidin-1-yl)propoxy)quinazolin-3(4H)-yl)acetamide
TypeSmall organic molecule
Emp. Form.C28H36N4O4
Mol. Mass.492.6098
SMILESCOc1cccc(c1)-c1nc2ccc(OCCCN3CCCCC3)cc2c(=O)n1CC(=O)NC(C)C