Reaction Details
TargetCysteine proteinase falcipain 3
LigandBDBM50286441
Substrate/Competitorn/a
Meas. Tech.ChEMBL_730505 (CHEMBL1697475)
IC50 87±n/a nM
Citation Lisk, GPain, MGluzman, IYKambhampati, SFuruya, TSu, XZFay, MPGoldberg, DEDesai, SA Changes in the plasmodial surface anion channel reduce leupeptin uptake and can confer drug resistance in Plasmodium falciparum-infected erythrocytes. Antimicrob Agents Chemother52:2346-54 (2008) 
 
Cysteine proteinase falcipain 3
Name:Cysteine proteinase falcipain 3
Synonyms:Cysteine protease falcipain-3
Type:Protein
Mol. Mass.:56666.98
Organism:Plasmodium falciparum
Description:Q9NAW4
Residue:492
BDBM50286441
NameBDBM50286441
TypeSmall organic molecule
Emp. Form.C20H38N6O5
Mol. Mass.442.5529
SMILESCC(C)C[C@H](NC(C)=O)C(=O)N[C@@H](CC(C)C)C(=O)N[C@@H](CCCNC(N)=N)C(O)=O