Reaction Details
TargetFalcipain-2
LigandBDBM50339249
Substrate/Competitorn/a
Meas. Tech.ChEMBL_736241 (CHEMBL1693385)
IC50 42100±n/a nM
Citation Praveen Kumar, SGut, JGuedes, RCRosenthal, PJSantos, MMMoreira, R Design, synthesis and evaluation of 3-methylene-substituted indolinones as antimalarials. Eur J Med Chem46:927-33 (2011) 
 
Falcipain-2
Name:Falcipain-2
Synonyms:n/a
Type:Enzyme
Mol. Mass.:55912.57
Organism:Plasmodium falciparum
Description:n/a
Residue:484
BDBM50339249
NameBDBM50339249
TypeSmall organic molecule
Emp. Form.C20H28ClN3O2
Mol. Mass.377.908
SMILESCC(C)CCNC(=O)[C@H](CC(C)C)N=CC1C(=O)Nc2c1cccc2Cl