Reaction Details
TargetFalcipain-2
LigandBDBM50339250
Substrate/Competitorn/a
Meas. Tech.ChEMBL_736241 (CHEMBL1693385)
IC50 43300±n/a nM
Citation Praveen Kumar, SGut, JGuedes, RCRosenthal, PJSantos, MMMoreira, R Design, synthesis and evaluation of 3-methylene-substituted indolinones as antimalarials. Eur J Med Chem46:927-33 (2011) 
 
Falcipain-2
Name:Falcipain-2
Synonyms:n/a
Type:Enzyme
Mol. Mass.:55912.57
Organism:Plasmodium falciparum
Description:n/a
Residue:484
BDBM50339250
NameBDBM50339250
TypeSmall organic molecule
Emp. Form.C23H26ClN3O2
Mol. Mass.411.924
SMILESCC(C)CCNC(=O)[C@H](Cc1ccccc1)N=CC1C(=O)Nc2ccc(Cl)cc12