Reaction Details
TargetFalcipain-2
LigandBDBM50339257
Substrate/Competitorn/a
Meas. Tech.ChEMBL_736241 (CHEMBL1693385)
IC50>50000±n/a nM
Citation Praveen Kumar, SGut, JGuedes, RCRosenthal, PJSantos, MMMoreira, R Design, synthesis and evaluation of 3-methylene-substituted indolinones as antimalarials. Eur J Med Chem46:927-33 (2011) 
 
Falcipain-2
Name:Falcipain-2
Synonyms:n/a
Type:Enzyme
Mol. Mass.:55912.57
Organism:Plasmodium falciparum
Description:n/a
Residue:484
BDBM50339257
NameBDBM50339257
TypeSmall organic molecule
Emp. Form.C11H11ClN2O
Mol. Mass.222.671
SMILESCN(C)C=C1C(=O)Nc2cc(Cl)ccc12