Reaction Details
TargetFalcipain-2
LigandBDBM50339267
Substrate/Competitorn/a
Meas. Tech.ChEMBL_736241 (CHEMBL1693385)
IC50>50000±n/a nM
Citation Praveen Kumar, SGut, JGuedes, RCRosenthal, PJSantos, MMMoreira, R Design, synthesis and evaluation of 3-methylene-substituted indolinones as antimalarials. Eur J Med Chem46:927-33 (2011) 
 
Falcipain-2
Name:Falcipain-2
Synonyms:n/a
Type:Enzyme
Mol. Mass.:55912.57
Organism:Plasmodium falciparum
Description:n/a
Residue:484
BDBM50339267
NameBDBM50339267
TypeSmall organic molecule
Emp. Form.C21H19ClN4O
Mol. Mass.378.855
SMILESClc1ccc2c(NCCCN=CC3C(=O)Nc4ccccc34)ccnc2c1