Reaction Details
TargetCysteine proteinase falcipain 3
LigandBDBM50339253
Substrate/Competitorn/a
Meas. Tech.ChEMBL_736242 (CHEMBL1693386)
IC50>50000±n/a nM
Citation Praveen Kumar, SGut, JGuedes, RCRosenthal, PJSantos, MMMoreira, R Design, synthesis and evaluation of 3-methylene-substituted indolinones as antimalarials. Eur J Med Chem46:927-33 (2011) 
 
Cysteine proteinase falcipain 3
Name:Cysteine proteinase falcipain 3
Synonyms:Cysteine protease falcipain-3
Type:Protein
Mol. Mass.:56666.98
Organism:Plasmodium falciparum
Description:Q9NAW4
Residue:492
BDBM50339253
NameBDBM50339253
TypeSmall organic molecule
Emp. Form.C20H28ClN3O2
Mol. Mass.377.908
SMILESCC(C)CCNC(=O)[C@H](CC(C)C)N=CC1C(=O)Nc2cc(Cl)ccc12