Reaction Details
TargetCysteine proteinase falcipain 3
LigandBDBM50339251
Substrate/Competitorn/a
Meas. Tech.ChEMBL_736242 (CHEMBL1693386)
IC50>50000±n/a nM
Citation Praveen Kumar, SGut, JGuedes, RCRosenthal, PJSantos, MMMoreira, R Design, synthesis and evaluation of 3-methylene-substituted indolinones as antimalarials. Eur J Med Chem46:927-33 (2011) 
 
Cysteine proteinase falcipain 3
Name:Cysteine proteinase falcipain 3
Synonyms:Cysteine protease falcipain-3
Type:Protein
Mol. Mass.:56666.98
Organism:Plasmodium falciparum
Description:Q9NAW4
Residue:492
BDBM50339251
NameBDBM50339251
TypeSmall organic molecule
Emp. Form.C24H28ClN3O2
Mol. Mass.425.951
SMILESCC(C)CCNC(=O)[C@H](CCc1ccccc1)N=CC1C(=O)Nc2c1cccc2Cl