Reaction Details
TargetExtracellular calcium-sensing receptor
LigandBDBM50339320
Substrate/Competitorn/a
Meas. Tech.ChEMBL_736451 (CHEMBL1694279)
IC50 5.2±n/a nM
Citation Yoshida, MMori, AKotani, EOka, MMakino, HFujita, HBan, JIkeda, YKawamoto, TGoto, MKimura, HBaba, AYasuma, T Discovery of novel and potent orally active calcium-sensing receptor antagonists that stimulate pulselike parathyroid hormone secretion: synthesis and structure-activity relationships of tetrahydropyrazolopyrimidine derivatives. J Med Chem54:1430-40 (2011) 
 
Extracellular calcium-sensing receptor
Name:Extracellular calcium-sensing receptor
Type:Protein
Mol. Mass.:120663.13
Organism:Homo sapiens (Human)
Description:P41180
Residue:1078
BDBM50339320
NameBDBM50339320
Synonyms:CHEMBL1688103 | Ethyl 4-(1-{[(7,7-Dimethyl-5-phenyl-4,5,6,7-tetrahydropyrazolo-[1,5-a]pyrimidine-3-yl)carbonyl]amino}-1-ethylpropyl)benzoate
TypeSmall organic molecule
Emp. Form.C29H36N4O3
Mol. Mass.488.6211
SMILESCCOC(=O)c1ccc(cc1)C(CC)(CC)NC(=O)c1cnn2c1NC(CC2(C)C)c1ccccc1