Reaction Details
TargetExtracellular calcium-sensing receptor
LigandBDBM50339322
Substrate/Competitorn/a
Meas. Tech.ChEMBL_736451 (CHEMBL1694279)
IC50 380±n/a nM
Citation Yoshida, MMori, AKotani, EOka, MMakino, HFujita, HBan, JIkeda, YKawamoto, TGoto, MKimura, HBaba, AYasuma, T Discovery of novel and potent orally active calcium-sensing receptor antagonists that stimulate pulselike parathyroid hormone secretion: synthesis and structure-activity relationships of tetrahydropyrazolopyrimidine derivatives. J Med Chem54:1430-40 (2011) 
 
Extracellular calcium-sensing receptor
Name:Extracellular calcium-sensing receptor
Type:Protein
Mol. Mass.:120663.13
Organism:Homo sapiens (Human)
Description:P41180
Residue:1078
BDBM50339322
NameBDBM50339322
Synonyms:(5S,7R)-N-benzhydryl-5-phenyl-7-(trifluoromethyl)-4,5,6,7-tetrahydropyrazolo[1,5-a]pyrimidine-3-carboxamide | CHEMBL1688102
TypeSmall organic molecule
Emp. Form.C27H23F3N4O
Mol. Mass.476.4929
SMILESFC(F)(F)[C@H]1C[C@H](Nc2c(cnn12)C(=O)NC(c1ccccc1)c1ccccc1)c1ccccc1