Reaction Details
TargetExtracellular calcium-sensing receptor
LigandBDBM50339332
Substrate/Competitorn/a
Meas. Tech.ChEMBL_736451 (CHEMBL1694279)
IC50 7.3±n/a nM
Citation Yoshida, MMori, AKotani, EOka, MMakino, HFujita, HBan, JIkeda, YKawamoto, TGoto, MKimura, HBaba, AYasuma, T Discovery of novel and potent orally active calcium-sensing receptor antagonists that stimulate pulselike parathyroid hormone secretion: synthesis and structure-activity relationships of tetrahydropyrazolopyrimidine derivatives. J Med Chem54:1430-40 (2011) 
 
Extracellular calcium-sensing receptor
Name:Extracellular calcium-sensing receptor
Type:Protein
Mol. Mass.:120663.13
Organism:Homo sapiens (Human)
Description:P41180
Residue:1078
BDBM50339332
NameBDBM50339332
Synonyms:CHEMBL1689818 | N-[1-Ethyl-1-(4-fluorophenyl)propyl]-7,7-dimethyl-5-phenyl-4,5,6,7-tetrahydropyrazolo-[1,5-a]pyrimidine-3-carboxamide
TypeSmall organic molecule
Emp. Form.C26H31FN4O
Mol. Mass.434.5489
SMILESCCC(CC)(NC(=O)c1cnn2c1NC(CC2(C)C)c1ccccc1)c1ccc(F)cc1