Reaction Details
TargetMelanocortin receptor 3
LigandBDBM50339347
Substrate/Competitorn/a
Meas. Tech.ChEMBL_736470 (CHEMBL1694298)
EC50 4620±n/a nM
Citation Singh, AWilczynski, AHolder, JRWitek, RMDirain, MLXiang, ZEdison, ASHaskell-Luevano, C Incorporation of a bioactive reverse-turn heterocycle into a peptide template using solid-phase synthesis to probe melanocortin receptor selectivity and ligand conformations by 2D 1H NMR. J Med Chem54:1379-90 (2011) 
 
Melanocortin receptor 3
Name:Melanocortin receptor 3
Type:PROTEIN
Mol. Mass.:35808.24
Organism:Mus musculus
Description:ChEMBL_1498848
Residue:323
BDBM50339347
NameBDBM50339347
Synonyms:(S)-cis-(2S,5S,8S,11S,14R,19R,22S,25R,28S,31S)-22-((1H-imidazol-5-yl)methyl)-2-((1H-indol-3-yl)methyl)-5-(2-amino-2-oxoethyl)-N-((S)-1-amino-3-(4-hydroxyphenyl)-1-oxopropan-2-yl)-19-((S)-2-amino-3-(4-hydroxyphenyl)propanamido)-11,25-dibenzyl-31-(3-guanidinopropyl)-8-methyl-3,6,9,12,20,23,26,29,33-nonaoxo-16,17,35-trithia-1,4,7,10,13,21,24,27,30-nonaazabicyclo[26.4.4]hexatriacontane-14-carboxamide | CHEMBL1688111
TypeSmall organic molecule
Emp. Form.C77H94N20O15S3
Mol. Mass.1635.89
SMILESC[C@@H]1NC(=O)[C@H](CC(N)=O)NC(=O)[C@H](Cc2c[nH]c3ccccc23)N2C[C@H](CCCN=C(N)N)NC(=O)[C@@H](CSCC2=O)NC(=O)[C@@H](Cc2ccccc2)NC(=O)[C@H](Cc2cnc[nH]2)NC(=O)[C@H](CSSC[C@H](NC(=O)[C@H](Cc2ccccc2)NC1=O)C(=O)N[C@@H](Cc1ccc(O)cc1)C(N)=O)NC(=O)[C@@H](N)Cc1ccc(O)cc1