Reaction Details
TargetCarbonic anhydrase 2
LigandBDBM50339443
Substrate/Competitorn/a
Meas. Tech.ChEMBL_736560 (CHEMBL1692289)
Ki 513±n/a nM
Citation Lopez, MTrajkovic, JBornaghi, LFInnocenti, AVullo, DSupuran, CTPoulsen, SA Design, synthesis, and biological evaluation of novel carbohydrate-based sulfamates as carbonic anhydrase inhibitors. J Med Chem54:1481-9 (2011) 
 
Carbonic anhydrase 2
Name:Carbonic anhydrase 2
Type:Enzyme
Mol. Mass.:29250.71
Organism:Homo sapiens (Human)
Description:P00918
Residue:260
BDBM50339443
NameBDBM50339443
Synonyms:6'-Sulfamoyl-alpha,beta-maltose | CHEMBL1688316
TypeSmall organic molecule
Emp. Form.C12H23NO13S
Mol. Mass.421.375
SMILESNS(=O)(=O)OC[C@H]1O[C@H](O[C@H]2[C@H](O)[C@@H](O)[C@H](O)O[C@@H]2CO)[C@H](O)[C@@H](O)[C@@H]1O