Reaction Details
TargetCarbonic anhydrase 1
LigandBDBM50299579
Substrate/Competitorn/a
Meas. Tech.ChEMBL_736559 (CHEMBL1692288)
Ki 3710±n/a nM
Citation Lopez, MTrajkovic, JBornaghi, LFInnocenti, AVullo, DSupuran, CTPoulsen, SA Design, synthesis, and biological evaluation of novel carbohydrate-based sulfamates as carbonic anhydrase inhibitors. J Med Chem54:1481-9 (2011) 
 
Carbonic anhydrase 1
Name:Carbonic anhydrase 1
Type:Enzyme
Mol. Mass.:28873.37
Organism:Homo sapiens (Human)
Description:P00915
Residue:261
BDBM50299579
NameBDBM50299579
Synonyms:(2S,3R,4S,5R,6R)-3,4,5-trihydroxy-6-(hydroxymethyl)oxane-2-sulfonamide CHEMBL569412
TypeSmall organic molecule
Emp. Form.C6H13NO7S
Mol. Mass.243.235
SMILESNS(=O)(=O)[C@@H]1O[C@H](CO)[C@H](O)[C@H](O)[C@H]1O