Reaction Details
TargetCarbonic anhydrase 1
LigandBDBM50339442
Substrate/Competitorn/a
Meas. Tech.ChEMBL_736559 (CHEMBL1692288)
Ki 1190±n/a nM
Citation Lopez, MTrajkovic, JBornaghi, LFInnocenti, AVullo, DSupuran, CTPoulsen, SA Design, synthesis, and biological evaluation of novel carbohydrate-based sulfamates as carbonic anhydrase inhibitors. J Med Chem54:1481-9 (2011) 
 
Carbonic anhydrase 1
Name:Carbonic anhydrase 1
Type:Enzyme
Mol. Mass.:28873.37
Organism:Homo sapiens (Human)
Description:P00915
Residue:261
BDBM50339442
NameBDBM50339442
Synonyms:CHEMBL1688317 | Methyl-6-sulfamoyl-alpha-D-glucopyranose
TypeSmall organic molecule
Emp. Form.C7H15NO8S
Mol. Mass.273.261
SMILESCO[C@H]1O[C@H](COS(N)(=O)=O)[C@@H](O)[C@H](O)[C@H]1O