Reaction Details
TargetCarbonic anhydrase 1
LigandBDBM50339446
Substrate/Competitorn/a
Meas. Tech.ChEMBL_736559 (CHEMBL1692288)
Ki 1180±n/a nM
Citation Lopez, MTrajkovic, JBornaghi, LFInnocenti, AVullo, DSupuran, CTPoulsen, SA Design, synthesis, and biological evaluation of novel carbohydrate-based sulfamates as carbonic anhydrase inhibitors. J Med Chem54:1481-9 (2011) 
 
Carbonic anhydrase 1
Name:Carbonic anhydrase 1
Type:Enzyme
Mol. Mass.:28873.37
Organism:Homo sapiens (Human)
Description:P00915
Residue:261
BDBM50339446
NameBDBM50339446
Synonyms:6-Sulfamoyl-alpha,beta-D-glucopyranose | CHEMBL1688313
TypeSmall organic molecule
Emp. Form.C6H13NO8S
Mol. Mass.259.234
SMILESNS(=O)(=O)OC[C@H]1OC(O)[C@H](O)[C@@H](O)[C@@H]1O