Reaction Details
TargetCarbonic anhydrase 9
LigandBDBM50299574
Substrate/Competitorn/a
Meas. Tech.ChEMBL_736561 (CHEMBL1692290)
Ki 4150±n/a nM
Citation Lopez, MTrajkovic, JBornaghi, LFInnocenti, AVullo, DSupuran, CTPoulsen, SA Design, synthesis, and biological evaluation of novel carbohydrate-based sulfamates as carbonic anhydrase inhibitors. J Med Chem54:1481-9 (2011) 
 
Carbonic anhydrase 9
Name:Carbonic anhydrase 9
Type:Enzyme
Mol. Mass.:49669.03
Organism:Homo sapiens (Human)
Description:Catalytic domain of human cloned isozyme was used in the assay
Residue:459
BDBM50299574
NameBDBM50299574
Synonyms:(2R,3S,4S,5R,6S)-2-(acetoxymethyl)-6-sulfamoyltetrahydro-2H-pyran-3,4,5-triyl triacetate | CHEMBL579226
TypeSmall organic molecule
Emp. Form.C14H21NO11S
Mol. Mass.411.382
SMILESCC(=O)OC[C@H]1O[C@H]([C@H](OC(C)=O)[C@@H](OC(C)=O)[C@H]1OC(C)=O)S(N)(=O)=O