Reaction Details
TargetBcl-2-like protein 1
LigandBDBM50339781
Substrate/Competitorn/a
Meas. Tech.ChEMBL_735548 (CHEMBL1693053)
IC50 3±n/a nM
Citation Sleebs, BECzabotar, PEFairbrother, WJFairlie, WDFlygare, JAHuang, DCKersten, WJKoehler, MFLessene, GLowes, KParisot, JPSmith, BJSmith, MLSouers, AJStreet, IPYang, HBaell, JB Quinazoline sulfonamides as dual binders of the proteins B-cell lymphoma 2 and B-cell lymphoma extra long with potent proapoptotic cell-based activity. J Med Chem54:1914-26 (2011) 
 
Bcl-2-like protein 1
Name:Bcl-2-like protein 1
Type:Mitochondrion membrane; Single-pass membrane protein
Mol. Mass.:26039.60
Organism:Homo sapiens (Human)
Description:n/a
Residue:233
BDBM50339781
NameBDBM50339781
Synonyms:CHEMBL1689143 | N-(7-{4-[2-(4-Chloro-phenyl)-5,5-dimethyl-cyclohex-1-enylmethyl]-piperazin-1-yl}quinazolin-4-yl)-4-((R)-3-dimethylamino-1-phenylsulfanylmethyl-propylamino)-3-nitro-benzenesulfonamide
TypeSmall organic molecule
Emp. Form.C45H53ClN8O4S2
Mol. Mass.869.537
SMILESCN(C)CC[C@H](CSc1ccccc1)Nc1ccc(cc1[N+]([O-])=O)S(=O)(=O)Nc1ncnc2cc(ccc12)N1CCN(CC2=C(CCC(C)(C)C2)c2ccc(Cl)cc2)CC1