Reaction Details
Target11-beta-hydroxysteroid dehydrogenase type 2
LigandBDBM50339806
Substrate/Competitorn/a
Meas. Tech.ChEMBL_735656 (CHEMBL1693471)
IC50 104±n/a nM
Citation Gaware, RKhunt, RCzollner, LStanetty, CDa Cunha, TKratschmar, DVOdermatt, AKosma, PJordis, UClassen-Houben, D Synthesis of new glycyrrhetinic acid derived ring A azepanone, 29-urea and 29-hydroxamic acid derivatives as selective 11ß-hydroxysteroid dehydrogenase 2 inhibitors. Bioorg Med Chem19:1866-80 (2011) 
 
11-beta-hydroxysteroid dehydrogenase type 2
Name:11-beta-hydroxysteroid dehydrogenase type 2
Type:Enzyme
Mol. Mass.:44141.72
Organism:Homo sapiens (Human)
Description:Purified recombinant human 11beta-HSD2.
Residue:405
BDBM50339806
NameBDBM50339806
Synonyms:(3beta,18beta,20beta)-N-[-3-(Acetoxy)-11-oxo-30-norolean-12-en-20-yl]urea | CHEMBL1689173
TypeSmall organic molecule
Emp. Form.C32H50N2O4
Mol. Mass.526.7504
SMILESCC(=O)O[C@H]1CC[C@@]2(C)[C@@H](CC[C@]3(C)[C@@H]2C(=O)C=C2[C@@H]4C[C@](C)(CC[C@]4(C)CC[C@@]32C)NC(N)=O)C1(C)C