Reaction Details
TargetFatty-acid amide hydrolase 1
LigandBDBM50339875
Substrate/Competitorn/a
Meas. Tech.ChEMBL_740704 (CHEMBL1763766)
IC50 2±n/a nM
Citation Gustin, DJMa, ZMin, XLi, YHedberg, CGuimaraes, CPorter, ACLindstrom, MLester-Zeiner, DXu, GCarlson, TJXiao, SMeleza, CConnors, RWang, ZKayser, F Identification of potent, noncovalent fatty acid amide hydrolase (FAAH) inhibitors. Bioorg Med Chem Lett21:2492-6 (2011) 
 
Fatty-acid amide hydrolase 1
Name:Fatty-acid amide hydrolase 1
Type:Protein
Mol. Mass.:63071.19
Organism:Homo sapiens (Human)
Description:O00519
Residue:579
BDBM50339875
NameBDBM50339875
Synonyms:(S)-2-(3-(1-(4-(benzo[b]thiophen-2-yl)pyrimidin-2-yl)piperidin-3-yl)-2-methyl-1H-pyrrolo[2,3-b]pyridin-1-yl)ethanol | CHEMBL1761457
TypeSmall organic molecule
Emp. Form.C27H27N5OS
Mol. Mass.469.601
SMILESCc1c([C@@H]2CCCN(C2)c2nccc(n2)-c2cc3ccccc3s2)c2cccnc2n1CCO