Reaction Details
TargetFatty-acid amide hydrolase 1 [30-579]
LigandBDBM50339871
Substrate/Competitorn/a
Meas. Tech.ChEMBL_740703 (CHEMBL1763765)
IC50 4±n/a nM
Citation Gustin, DJMa, ZMin, XLi, YHedberg, CGuimaraes, CPorter, ACLindstrom, MLester-Zeiner, DXu, GCarlson, TJXiao, SMeleza, CConnors, RWang, ZKayser, F Identification of potent, noncovalent fatty acid amide hydrolase (FAAH) inhibitors. Bioorg Med Chem Lett21:2492-6 (2011) 
 
Fatty-acid amide hydrolase 1 [30-579]
Name:Fatty-acid amide hydrolase 1 [30-579]
Type:Single-pass membrane protein; homodimer
Mol. Mass.:60474.00
Organism:Rattus norvegicus (rat)
Description:P97612 (aa 30-579)
Residue:550
BDBM50339871
NameBDBM50339871
Synonyms:(S)-3-(1-(4-(5-chlorothiophen-2-yl)pyrimidin-2-yl)piperidin-3-yl)-1-ethyl-1H-imidazo[4,5-b]pyridin-2(3H)-one | CHEMBL1761301
TypeSmall organic molecule
Emp. Form.C21H21ClN6OS
Mol. Mass.440.949
SMILESCCn1c2cccnc2n([C@H]2CCCN(C2)c2nccc(n2)-c2ccc(Cl)s2)c1=O