Reaction Details
TargetFatty-acid amide hydrolase 1
LigandBDBM50339886
Substrate/Competitorn/a
Meas. Tech.ChEMBL_740704 (CHEMBL1763766)
IC50 14±n/a nM
Citation Gustin, DJMa, ZMin, XLi, YHedberg, CGuimaraes, CPorter, ACLindstrom, MLester-Zeiner, DXu, GCarlson, TJXiao, SMeleza, CConnors, RWang, ZKayser, F Identification of potent, noncovalent fatty acid amide hydrolase (FAAH) inhibitors. Bioorg Med Chem Lett21:2492-6 (2011) 
 
Fatty-acid amide hydrolase 1
Name:Fatty-acid amide hydrolase 1
Type:Protein
Mol. Mass.:63071.19
Organism:Homo sapiens (Human)
Description:O00519
Residue:579
BDBM50339886
NameBDBM50339886
Synonyms:(S)-3-(1-(2-amino-6-(4-fluorophenyl)pyrimidin-4-yl)piperidin-3-yl)-1-ethyl-1H-imidazo[4,5-b]pyridin-2(3H)-one | CHEMBL1761304
TypeSmall organic molecule
Emp. Form.C23H24FN7O
Mol. Mass.433.4814
SMILESCCn1c2cccnc2n([C@H]2CCCN(C2)c2cc(nc(N)n2)-c2ccc(F)cc2)c1=O