Reaction Details
TargetFatty-acid amide hydrolase 1 [30-579]
LigandBDBM50161517
Substrate/Competitorn/a
Meas. Tech.ChEMBL_740703 (CHEMBL1763765)
IC50 25±n/a nM
Citation Gustin, DJMa, ZMin, XLi, YHedberg, CGuimaraes, CPorter, ACLindstrom, MLester-Zeiner, DXu, GCarlson, TJXiao, SMeleza, CConnors, RWang, ZKayser, F Identification of potent, noncovalent fatty acid amide hydrolase (FAAH) inhibitors. Bioorg Med Chem Lett21:2492-6 (2011) 
 
Fatty-acid amide hydrolase 1 [30-579]
Name:Fatty-acid amide hydrolase 1 [30-579]
Type:Single-pass membrane protein; homodimer
Mol. Mass.:60474.00
Organism:Rattus norvegicus (rat)
Description:P97612 (aa 30-579)
Residue:550
BDBM50161517
NameBDBM50161517
Synonyms:6-Phenyl-1-(5-pyridin-2-yl-oxazol-2-yl)-hexan-1-one CHEMBL366959
TypeSmall organic molecule
Emp. Form.C20H20N2O2
Mol. Mass.320.385
SMILESO=C(CCCCCc1ccccc1)c1ncc(o1)-c1ccccn1