Reaction Details
TargetFatty-acid amide hydrolase 1 [30-579]
LigandBDBM50339892
Substrate/Competitorn/a
Meas. Tech.ChEMBL_740703 (CHEMBL1763765)
IC50 280±n/a nM
Citation Gustin, DJMa, ZMin, XLi, YHedberg, CGuimaraes, CPorter, ACLindstrom, MLester-Zeiner, DXu, GCarlson, TJXiao, SMeleza, CConnors, RWang, ZKayser, F Identification of potent, noncovalent fatty acid amide hydrolase (FAAH) inhibitors. Bioorg Med Chem Lett21:2492-6 (2011) 
 
Fatty-acid amide hydrolase 1 [30-579]
Name:Fatty-acid amide hydrolase 1 [30-579]
Type:Single-pass membrane protein; homodimer
Mol. Mass.:60474.00
Organism:Rattus norvegicus (rat)
Description:P97612 (aa 30-579)
Residue:550
BDBM50339892
NameBDBM50339892
Synonyms:(S)-1-ethyl-3-(1-(2-p-tolylpyrimidin-4-yl)piperidin-3-yl)-1H-benzo[d]imidazol-2(3H)-one | CHEMBL1761297
TypeSmall organic molecule
Emp. Form.C25H27N5O
Mol. Mass.413.5148
SMILESCCn1c2ccccc2n([C@H]2CCCN(C2)c2ccnc(n2)-c2ccc(C)cc2)c1=O