Reaction Details
TargetFatty-acid amide hydrolase 1 [30-579]
LigandBDBM50339878
Substrate/Competitorn/a
Meas. Tech.ChEMBL_740703 (CHEMBL1763765)
IC50>10000±n/a nM
Citation Gustin, DJMa, ZMin, XLi, YHedberg, CGuimaraes, CPorter, ACLindstrom, MLester-Zeiner, DXu, GCarlson, TJXiao, SMeleza, CConnors, RWang, ZKayser, F Identification of potent, noncovalent fatty acid amide hydrolase (FAAH) inhibitors. Bioorg Med Chem Lett21:2492-6 (2011) 
 
Fatty-acid amide hydrolase 1 [30-579]
Name:Fatty-acid amide hydrolase 1 [30-579]
Type:Single-pass membrane protein; homodimer
Mol. Mass.:60474.00
Organism:Rattus norvegicus (rat)
Description:P97612 (aa 30-579)
Residue:550
BDBM50339878
NameBDBM50339878
Synonyms:(S)-3-(1-(4-(benzofuran-2-yl)pyrimidin-2-yl)piperidin-3-yl)-1-ethyl-1H-imidazo[4,5-b]pyridin-2(3H)-one | CHEMBL1761285
TypeSmall organic molecule
Emp. Form.C25H24N6O2
Mol. Mass.440.4971
SMILESCCn1c2cccnc2n([C@H]2CCCN(C2)c2nccc(n2)-c2cc3ccccc3o2)c1=O