Reaction Details
TargetPolyphenol oxidase 2
LigandBDBM33932
Substrate/Competitorn/a
Meas. Tech.ChEMBL_739668 (CHEMBL1763494)
Ki 567±n/a nM
Citation Ha, YMPark, JYPark, YJPark, DChoi, YJKim, JMLee, EKHan, YKKim, JALee, JYMoon, HRChung, HY Synthesis and biological activity of hydroxy substituted phenyl-benzo[d]thiazole analogues for antityrosinase activity in B16 cells. Bioorg Med Chem Lett21:2445-9 (2011) 
 
Polyphenol oxidase 2
Name:Polyphenol oxidase 2
Type:Protein
Mol. Mass.:63923.66
Organism:Agaricus bisporus (Common mushroom)
Description:O42713
Residue:556
BDBM33932
NameBDBM33932
Synonyms:4-(3H-1,3-benzothiazol-2-ylidene)-1-cyclohexa-2,5-dienone CHEMBL47875 SMR000364661 | cid_5351155
TypeSmall organic molecule
Emp. Form.C13H9NOS
Mol. Mass.227.282
SMILESOc1ccc(cc1)-c1nc2ccccc2s1