Reaction Details
TargetSodium/glucose cotransporter 1
LigandBDBM20880
Substrate/Competitorn/a
Meas. Tech.ChEMBL_740119 (CHEMBL1763179)
IC50 370±n/a nM
Citation Li, ARZhang, JGreenberg, JLee, TLiu, J Discovery of non-glucoside SGLT2 inhibitors. Bioorg Med Chem Lett21:2472-5 (2011) 
 
Sodium/glucose cotransporter 1
Name:Sodium/glucose cotransporter 1
Type:Protein
Mol. Mass.:73503.78
Organism:Homo sapiens (Human)
Description:P13866
Residue:664
BDBM20880
NameBDBM20880
Synonyms:(2S,3R,4R,5S,6R)-2-{4-chloro-3-[(4-ethoxyphenyl)methyl]phenyl}-6-(hydroxymethyl)oxane-3,4,5-triol C-aryl glucoside, 6 Dapagliflozin
TypeSmall organic molecule
Emp. Form.C21H25ClO6
Mol. Mass.408.873
SMILESCCOc1ccc(Cc2cc(ccc2Cl)[C@@H]2O[C@H](CO)[C@@H](O)[C@H](O)[C@H]2O)cc1