Reaction Details
TargetSodium/glucose cotransporter 1
LigandBDBM20875
Substrate/Competitorn/a
Meas. Tech.ChEMBL_740117 (CHEMBL1763177)
IC50 330±n/a nM
Citation Li, ARZhang, JGreenberg, JLee, TLiu, J Discovery of non-glucoside SGLT2 inhibitors. Bioorg Med Chem Lett21:2472-5 (2011) 
 
Sodium/glucose cotransporter 1
Name:Sodium/glucose cotransporter 1
Type:Protein
Mol. Mass.:73503.78
Organism:Homo sapiens (Human)
Description:P13866
Residue:664
BDBM20875
NameBDBM20875
Synonyms:1-(2,4-dihydroxy-6-{[(2S,3R,4S,5S,6R)-3,4,5-trihydroxy-6-(hydroxymethyl)oxan-2-yl]oxy}phenyl)-3-(4-hydroxyphenyl)propan-1-one CHEMBL245067 O-glucoside, 1 | Phlorizin
TypeNatural product
Emp. Form.C21H24O10
Mol. Mass.436.4093
SMILESOC[C@H]1O[C@@H](Oc2cc(O)cc(O)c2C(=O)CCc2ccc(O)cc2)[C@H](O)[C@@H](O)[C@@H]1O