Reaction Details
TargetAcetylcholinesterase
LigandBDBM50340112
Substrate/Competitorn/a
Meas. Tech.ChEMBL_741145 (CHEMBL1764416)
IC50 20±n/a nM
Citation Maalej, EChabchoub, FSamadi, Ade los Ríos, CPerona, AMorreale, AMarco-Contelles, J Synthesis, biological assessment and molecular modeling of 14-aryl-10,11,12,14-tetrahydro-9H-benzo[5,6]chromeno[2,3-b]quinolin-13-amines. Bioorg Med Chem Lett21:2384-8 (2011) 
 
Acetylcholinesterase
Name:Acetylcholinesterase
Type:Enzyme
Mol. Mass.:71812.79
Organism:Electrophorus electricus (Electric eel)
Description:n/a
Residue:633
BDBM50340112
NameBDBM50340112
Synonyms:CHEMBL1762830 | rac-14-(2'-Methoxyphenyl)-10,11,12,14-tetrahydro-9H-benzo[5,6]chromeno[2,3-b]quinolin-13-amine
TypeSmall organic molecule
Emp. Form.C27H24N2O2
Mol. Mass.408.4917
SMILESCOc1ccccc1C1c2c(N)c3CCCCc3nc2Oc2ccc3ccccc3c12