Reaction Details
TargetRAF proto-oncogene serine/threonine-protein kinase
LigandBDBM50340264
Substrate/Competitorn/a
Meas. Tech.ChEMBL_741467 (CHEMBL1763782)
IC50 110±n/a nM
Citation Buchstaller, HPBurgdorf, LFinsinger, DStieber, FSirrenberg, CAmendt, CGrell, MZenke, FKrier, M Design and synthesis of isoquinolines and benzimidazoles as RAF kinase inhibitors. Bioorg Med Chem Lett21:2264-9 (2011) 
 
RAF proto-oncogene serine/threonine-protein kinase
Name:RAF proto-oncogene serine/threonine-protein kinase
Type:Serine/threonine-protein kinase
Mol. Mass.:73082.52
Organism:Homo sapiens (Human)
Description:P04049
Residue:648
BDBM50340264
NameBDBM50340264
Synonyms:7-(2-(3-(5-chloro-2-methoxy-4-methylphenyl)ureido)ethyl)-N-methylisoquinoline-3-carboxamide | CHEMBL1760625
TypeSmall organic molecule
Emp. Form.C22H23ClN4O3
Mol. Mass.426.896
SMILESCNC(=O)c1cc2ccc(CCNC(=O)Nc3cc(Cl)c(C)cc3OC)cc2cn1