Reaction Details
TargetTranscription factor Jun
LigandBDBM50340610
Substrate/Competitorn/a
Meas. Tech.ChEMBL_739507 (CHEMBL1763333)
IC50 250±n/a nM
Citation He, YKamenecka, TMShin, YSong, XJiang, RNoel, RDuckett, DChen, WLing, YYCameron, MDLin, LKhan, SKoenig, MLoGrasso, PV Synthesis and SAR of novel quinazolines as potent and brain-penetrant c-jun N-terminal kinase (JNK) inhibitors. Bioorg Med Chem Lett21:1719-23 (2011) 
 
Transcription factor Jun
Name:Transcription factor Jun
Type:n/a
Mol. Mass.:35683.24
Organism:Homo sapiens (Human)
Description:P05412
Residue:331
BDBM50340610
NameBDBM50340610
Synonyms:8-(3-fluoro-4-methoxyphenyl)-N-(4-(3-morpholino-1H-1,2,4-triazol-1-yl)phenyl)quinazolin-2-amine | CHEMBL1761565
TypeSmall organic molecule
Emp. Form.C27H24FN7O2
Mol. Mass.497.5236
SMILESCOc1ccc(cc1F)-c1cccc2cnc(Nc3ccc(cc3)-n3cnc(n3)N3CCOCC3)nc12