Reaction Details
TargetMitogen-activated protein kinase kinase kinase 7/TGF-beta-activated kinase 1 and MAP3K7-binding protein 1
LigandBDBM50042034
Substrate/Competitorn/a
Meas. Tech.ChEBML_739577
IC50 8±n/a nM
Citation Lockman, JWReeder, MDRobinson, ROrmonde, PACimbora, DMWilliams, BLWillardsen, JA Oxindole derivatives as inhibitors of TAK1 kinase. Bioorg Med Chem Lett21:1724-7 (2011) 
 
Mitogen-activated protein kinase kinase kinase 7/TGF-beta-activated kinase 1 and MAP3K7-binding protein 1
Name:Mitogen-activated protein kinase kinase kinase 7/TGF-beta-activated kinase 1 and MAP3K7-binding protein 1
Type:n/a
Mol. Mass.:n/a
Description:ASSAY_ID of EBI is 739577
Components:This complex has 2 components.
Component 1
Name:TGF-beta-activated kinase 1 and MAP3K7-binding protein 1
Synonyms:MAP3K7IP1 TAB1 TAK1-binding protein 1 | TGF-beta-activated kinase 1-binding protein1
Type:Enzyme
Mol. Mass.:54633.89
Organism:Homo sapiens (Human)
Description:Q15750
Residue:504
Component 2
Name:Mitogen-activated protein kinase kinase kinase 7
Synonyms:M3K7_HUMAN Mitogen-activated protein kinase kinase kinase 7 TAK1/TAB1 Transforming growth factor-beta-activated kinase 1 (TAK1)
Type:Protein
Mol. Mass.:67199.89
Organism:Homo sapiens (Human)
Description:O43318
Residue:606
BDBM50042034
NameBDBM50042034
Synonyms:(5Z)-7-Oxozeaenol CHEBI:67559 | CHEMBL1077979
TypeSmall organic molecule
Emp. Form.C19H22O7
Mol. Mass.362.3738
SMILESCOc1cc(O)c2c(c1)\C=C\C[C@H](O)[C@H](O)C(=O)\C=C/C[C@H](C)OC2=O