Reaction Details
TargetGlucocorticoid receptor
LigandBDBM50340664
Substrate/Competitorn/a
Meas. Tech.ChEMBL_739804 (CHEMBL1762864)
IC50 4±n/a nM
Citation Hudson, ARHiguchi, RIRoach, SLValdez, LJAdams, MEVassar, ARungta, DSyka, PMMais, DEMarschke, KBZhi, L Nonsteroidal 2,3-dihydroquinoline glucocorticoid receptor agonists with reduced PEPCK activation. Bioorg Med Chem Lett21:1654-7 (2011) 
 
Glucocorticoid receptor
Name:Glucocorticoid receptor
Type:Enzyme
Mol. Mass.:85656.87
Organism:Homo sapiens (Human)
Description:P04150
Residue:777
BDBM50340664
NameBDBM50340664
Synonyms:6-(3-chloro-1H-indol-7-yl)-5,7-difluoro-2,2-dimethyl-2,3-dihydroquinolin-4(1H)-one O-tert-butyl oxime | CHEMBL1762203
TypeSmall organic molecule
Emp. Form.C23H24ClF2N3O
Mol. Mass.431.906
SMILESCC(C)(C)O\N=C1/CC(C)(C)Nc2cc(F)c(c(F)c12)-c1cccc2c(Cl)c[nH]c12