Reaction Details
TargetGlucocorticoid receptor
LigandBDBM50340669
Substrate/Competitorn/a
Meas. Tech.ChEMBL_739803 (CHEMBL1762863)
Ki 5.8±n/a nM
Citation Hudson, ARHiguchi, RIRoach, SLValdez, LJAdams, MEVassar, ARungta, DSyka, PMMais, DEMarschke, KBZhi, L Nonsteroidal 2,3-dihydroquinoline glucocorticoid receptor agonists with reduced PEPCK activation. Bioorg Med Chem Lett21:1654-7 (2011) 
 
Glucocorticoid receptor
Name:Glucocorticoid receptor
Type:Enzyme
Mol. Mass.:85656.87
Organism:Homo sapiens (Human)
Description:P04150
Residue:777
BDBM50340669
NameBDBM50340669
Synonyms:5,7-difluoro-2,2-dimethyl-6-(3-methyl-1H-indol-7-yl)-2,3-dihydroquinolin-4(1H)-one O-benzyl oxime | CHEMBL1762206
TypeSmall organic molecule
Emp. Form.C27H25F2N3O
Mol. Mass.445.5037
SMILESCc1c[nH]c2c(cccc12)-c1c(F)cc2NC(C)(C)C\C(=N/OCc3ccccc3)c2c1F