Reaction Details
TargetGlucocorticoid receptor
LigandBDBM50340671
Substrate/Competitorn/a
Meas. Tech.ChEMBL_739803 (CHEMBL1762863)
Ki 0.4±n/a nM
Citation Hudson, ARHiguchi, RIRoach, SLValdez, LJAdams, MEVassar, ARungta, DSyka, PMMais, DEMarschke, KBZhi, L Nonsteroidal 2,3-dihydroquinoline glucocorticoid receptor agonists with reduced PEPCK activation. Bioorg Med Chem Lett21:1654-7 (2011) 
 
Glucocorticoid receptor
Name:Glucocorticoid receptor
Type:Enzyme
Mol. Mass.:85656.87
Organism:Homo sapiens (Human)
Description:P04150
Residue:777
BDBM50340671
NameBDBM50340671
Synonyms:5,7-difluoro-6-(1H-indol-7-yl)-2,2-dimethyl-2,3-dihydroquinolin-4(1H)-one O-ethyl oxime | CHEMBL1762200
TypeSmall organic molecule
Emp. Form.C21H21F2N3O
Mol. Mass.369.4077
SMILESCCO\N=C1/CC(C)(C)Nc2cc(F)c(c(F)c12)-c1cccc2cc[nH]c12