Reaction Details
TargetLethal factor
LigandBDBM50340757
Substrate/Competitorn/a
Meas. Tech.ChEMBL_740261 (CHEMBL1764161)
Ki 0.39±n/a nM
Citation Kim, SJiao, GSMoayeri, MCrown, DCregar-Hernandez, LMcKasson, LMargosiak, SALeppla, SHJohnson, AT Antidotes to anthrax lethal factor intoxication. Part 2: structural modifications leading to improved in vivo efficacy. Bioorg Med Chem Lett21:2030-3 (2011) 
 
Lethal factor
Name:Lethal factor
Type:PROTEIN
Mol. Mass.:93758.56
Organism:Bacillus anthracis
Description:ChEMBL_1460338
Residue:809
BDBM50340757
NameBDBM50340757
Synonyms:(S)-2-(4-fluoro-3,5-dimethylbenzyl)-6-(4-fluoro-3-methylbenzylamino)-N-hydroxyhexanamide | CHEMBL1760316
TypeSmall organic molecule
Emp. Form.C23H30F2N2O2
Mol. Mass.404.4933
SMILESCc1cc(CNCCCC[C@@H](Cc2cc(C)c(F)c(C)c2)C(=O)NO)ccc1F